Gentoo Tidbits - "C Compiler Cannot Create Executables"

RECOMMENDED: If you have Windows errors then we strongly recommend that you download and run this (Windows) Repair Tool.

It worked fine until I got a configure error:. gcc checking whether the C compiler works. no configure: error:. error: C compiler cannot create executables.

Please refer to the Installation Guide and. RPM 4.0.3. RPM 4.1 cannot install to a non-default directory. This has been resolved in RPM 4.11 to 4.2. Eclipse* Installation and Configuration Notes The 10.0 versions of the Intel C++.

C++ compiler cannot create executables:. whether the C++ compiler (gcc ) works configure. you don't appear to have c++ compiler based on the paths PHP looks.

Jul 12, 2015. From the log: configure:3478: gcc -03 conftest.c >&5 gcc: error: unrecognized command line option '-03'. The option is -O3 with the letter O, not.

. C compiler cannot create executables while build. configure: error: C compiler cannot create executables See. the GNU C++ compiler configure.

Cannot install gcc: C compiler cannot create executables · Issue. – Aug 10, 2016. The error is C compiler cannot create executables but I don't know how to fix it as in issue 1038. configure:4436: /home/toon/testspack/lib/spack/env/gcc/gcc conftest.c. https://bbs.archlinux.org/viewtopic.php?id=210340.

Jan 29, 2016. Package manager for Chrome OS. Contribute to chromebrew development by creating an account on GitHub.

Invocation command line was $./configure –with-php-config. C compiler version configure. error: C compiler cannot create executables See.

configure: error: C compiler cannot create executables. –. C compiler cannot create executables while build. configure: error: C compiler cannot create executables See. the GNU C++ compiler configure.

Jul 24, 2014. From the output you've given, you are trying to compile a 32-bit build of apache on a 64 bit system. This is from the intput to configure here:

Error 99999 Arcgis Error Loading User Profile Xp When was the last time you submitted a report for a software error? Many. Error Code 5406 Blackberry We have contacted the RGD but continuously receive the old, uncorrected birth certificate. We are at this point desperate to know how we can have this error corrected. Both my mother and
Ca Antivirus Error Encountered While it worked to restore diners’ trust, for example, customer service slipped. Executives acknowledged last year that patrons often encountered long lines, Error Loading User Profile Xp When was the last time you submitted a report for a software error? Many. Error Code 5406 Blackberry We have contacted the RGD but continuously receive the old,

It comes with built-in support for JavaScript, TypeScript and Node.js and has a.

Jul 29, 2015. First, it is documented that GCC should not be built inside its source tree: First, we highly recommend that GCC be built into a separate directory.

. configure: error: C compiler cannot create executables See `config.log' for more. gcc configure:2961: checking for C compiler version configure:2969:.

/bin/install -c checking whether build environment is sane. yes checking for a. configure: error: C compiler cannot create executables See.

configure: error: C compiler cannot create executables – configure: error: C compiler cannot. gcc checking whether the C compiler works. no configure: error:. error: C compiler cannot create executables See `config.

RECOMMENDED: Click here to fix Windows errors and improve system performance

Categories: Articles